Test Reports Dashboard

⚠ Partial run. The time budget cut this run short, so the totals below are a lower bound, not a full-suite result. Suites with no results: graph-editor, question-bank, home, settings. Comparing these counts against another run is not meaningful.
Last updated: 2026-10-05 03:37 UTC
Branch: DEVELOPMENT  ·  Commit: 01d0778
⚠️ Overall: PARTIAL RUN — SOME FAILURES

Latest Run Frontend + Backend

1630
Total
1615
Passed
5
Failed
0
Errors
10
Skipped

Suites

Frontend (Client — Playwright)
❌ FAILED
559Total 550Passed 5Failed 0Errors 4Skipped
⏱ 2h 04m 33s
Summary →  ·  Allure Report →
Backend (Service — API)
✅ PASSED
1071Total 1065Passed 0Failed 0Errors 6Skipped
⏱ 6m 37s
Summary →  ·  Allure Report →  ·  Endpoint Coverage →
TS API Unit Tests
📊 91.6%
6247Total6247Passed0Failed
eruditiontx-services-mvp @ 6c44633
↻ local run · 18h ago
Allure Report →Coverage →
TS Frontend Unit Tests
📊 79.5%
5624Total5620Passed0Failed
eruditiontx-client-mvp @ b7bafb7
↻ local run · 17h ago
Allure Report →Coverage →

Last 1 Runs

Run Total Passed Failed Errors Skipped Status
Latest 1630 1615 5 0 10 FAILED